Reaction Details
TargetMelatonin receptor type 1A
LigandBDBM50035179
Substrate/Competitorn/a
Meas. Tech.ChEMBL_937788 (CHEMBL2318042)
Ki 0.100000±n/a nM
Citation Morellato, LLefas-Le Gall, MLanglois, MCaignard, DHRenard, PDelagrange, PMathé-Allainmat, M Synthesis of new N-(arylcyclopropyl)acetamides and N-(arylvinyl)acetamides as conformationally-restricted ligands for melatonin receptors. Bioorg Med Chem Lett23:430-4 (2012) 
 
Melatonin receptor type 1A
Name:Melatonin receptor type 1A
Type:Enzyme
Mol. Mass.:39392.94
Organism:Homo sapiens (Human)
Description:P48039
Residue:350
BDBM50035179
NameBDBM50035179
Synonyms:Agomelatine N-[2-(7-Methoxy-naphthalen-1-yl)-ethyl]-acetamide S 20098 US11091445, Compound code IA2-76
TypeSmall organic molecule
Emp. Form.C15H17NO2
Mol. Mass.243.301
SMILESCOc1ccc2cccc(CCNC(C)=O)c2c1