Reaction Details
TargetMelatonin receptor type 1A
LigandBDBM50425201
Substrate/Competitorn/a
Meas. Tech.ChEMBL_937788 (CHEMBL2318042)
Ki 0.100000±n/a nM
Citation Morellato, LLefas-Le Gall, MLanglois, MCaignard, DHRenard, PDelagrange, PMathé-Allainmat, M Synthesis of new N-(arylcyclopropyl)acetamides and N-(arylvinyl)acetamides as conformationally-restricted ligands for melatonin receptors. Bioorg Med Chem Lett23:430-4 (2012) 
 
Melatonin receptor type 1A
Name:Melatonin receptor type 1A
Type:Enzyme
Mol. Mass.:39392.94
Organism:Homo sapiens (Human)
Description:P48039
Residue:350
BDBM50425201
NameBDBM50425201
Synonyms:CHEMBL2314257
TypeSmall organic molecule
Emp. Form.C15H15NO2
Mol. Mass.241.2851
SMILESCOc1ccc2ccccc2c1\C=C\NC(C)=O