Reaction Details
TargetToll-like receptor 7
LigandBDBM50425233
Substrate/Competitorn/a
Meas. Tech.ChEMBL_933765 (CHEMBL2321101)
EC50 6224±n/a nM
Citation Nakamura, TWada, HKurebayashi, HMcInally, TBonnert, RIsobe, Y Synthesis and evaluation of 8-oxoadenine derivatives as potent Toll-like receptor 7 agonists with high water solubility. Bioorg Med Chem Lett23:669-72 (2013) 
 
Toll-like receptor 7
Name:Toll-like receptor 7
Type:PROTEIN
Mol. Mass.:121844.65
Organism:Mus musculus
Description:ChEMBL_933765
Residue:1050
BDBM50425233
NameBDBM50425233
Synonyms:CHEMBL549344
TypeSmall organic molecule
Emp. Form.C17H23N5O2S
Mol. Mass.361.462
SMILESCCc1nc2c(N)nc3ccccc3c2n1CCCCNS(C)(=O)=O