Reaction Details
TargetToll-like receptor 7
LigandBDBM50425236
Substrate/Competitorn/a
Meas. Tech.ChEMBL_933767 (CHEMBL2321103)
EC50 5.4±n/a nM
Citation Nakamura, TWada, HKurebayashi, HMcInally, TBonnert, RIsobe, Y Synthesis and evaluation of 8-oxoadenine derivatives as potent Toll-like receptor 7 agonists with high water solubility. Bioorg Med Chem Lett23:669-72 (2013) 
 
Toll-like receptor 7
Name:Toll-like receptor 7
Type:Enzyme
Mol. Mass.:120945.35
Organism:Homo sapiens (Human)
Description:Q9NYK1
Residue:1049
BDBM50425236
NameBDBM50425236
Synonyms:CHEMBL2315166
TypeSmall organic molecule
Emp. Form.C20H29N9O
Mol. Mass.411.504
SMILESCCCCNc1nc(N)c2[nH]c(=O)n(Cc3ccc(nc3)N3CCN(C)CC3)c2n1