Reaction Details
TargetProstaglandin E synthase
LigandBDBM50425324
Substrate/Competitorn/a
Meas. Tech.ChEMBL_933843 (CHEMBL2321397)
IC50 826±n/a nM
Citation Kablaoui, NPatel, SShao, JDemian, DHoffmaster, KBerlioz, FVazquez, MLMoore, WMNugent, RA Novel benzoxazole inhibitors of mPGES-1. Bioorg Med Chem Lett23:907-11 (2013) 
 
Prostaglandin E synthase
Name:Prostaglandin E synthase
Type:Protein
Mol. Mass.:17112.22
Organism:Homo sapiens (Human)
Description:n/a
Residue:152
BDBM50425324
NameBDBM50425324
Synonyms:CHEMBL2315864
TypeSmall organic molecule
Emp. Form.C22H30ClN3O3
Mol. Mass.419.945
SMILESCCCCO[C@@H]1CCC[C@H]1NC(=O)C1CCN(CC1)c1nc2cc(Cl)ccc2o1