Reaction Details
TargetProstaglandin E synthase
LigandBDBM50425329
Substrate/Competitorn/a
Meas. Tech.ChEMBL_933843 (CHEMBL2321397)
IC50 821±n/a nM
Citation Kablaoui, NPatel, SShao, JDemian, DHoffmaster, KBerlioz, FVazquez, MLMoore, WMNugent, RA Novel benzoxazole inhibitors of mPGES-1. Bioorg Med Chem Lett23:907-11 (2013) 
 
Prostaglandin E synthase
Name:Prostaglandin E synthase
Type:Protein
Mol. Mass.:17112.22
Organism:Homo sapiens (Human)
Description:n/a
Residue:152
BDBM50425329
NameBDBM50425329
Synonyms:CHEMBL2315868
TypeSmall organic molecule
Emp. Form.C20H26ClN3O2
Mol. Mass.375.892
SMILESClc1ccc2oc(nc2c1)N1CCC(CC1)C(=O)NC1CCCCCC1