Reaction Details
TargetThyroid hormone receptor alpha
LigandBDBM50036399
Substrate/Competitorn/a
Meas. Tech.ChEMBL_935147 (CHEMBL2317309)
Ki 40±n/a nM
Citation Shiohara, HNakamura, TKikuchi, NOzawa, TMatsuzawa, ANagano, ROhnota, HMiyamoto, TIchikawa, KHashizume, K Design, synthesis, and structure-activity relationship (SAR) of N-[7-(4-hydroxyphenoxy)-6-methylindan-4-yl]malonamic acids as thyroid hormone receptorß (TRß) selective agonists. Bioorg Med Chem21:592-607 (2013) 
 
Thyroid hormone receptor alpha
Name:Thyroid hormone receptor alpha
Type:Receptor
Mol. Mass.:54818.00
Organism:Homo sapiens (Human)
Description:Recombinant hThR was obtained from nuclear extracts from SF9 cells infected with baculovirus vectors encoding for ThRalpha 1.
Residue:490
BDBM50036399
NameBDBM50036399
Synonyms:Axitirome N-(4-{3-[(4-Fluoro-phenyl)-hydroxy-methyl]-4-hydroxy-phenoxy}-3,5-dimethyl-phenyl)-oxalamic acid ethyl ester
TypeSmall organic molecule
Emp. Form.C25H24FNO6
Mol. Mass.453.4596
SMILESCCOC(=O)C(=O)Nc1cc(C)c(Oc2ccc(O)c(c2)C(O)c2ccc(F)cc2)c(C)c1