Reaction Details
TargetThyroid hormone receptor beta
LigandBDBM50425399
Substrate/Competitorn/a
Meas. Tech.ChEMBL_935146 (CHEMBL2317308)
Ki 6.0±n/a nM
Citation Shiohara, HNakamura, TKikuchi, NOzawa, TMatsuzawa, ANagano, ROhnota, HMiyamoto, TIchikawa, KHashizume, K Design, synthesis, and structure-activity relationship (SAR) of N-[7-(4-hydroxyphenoxy)-6-methylindan-4-yl]malonamic acids as thyroid hormone receptorß (TRß) selective agonists. Bioorg Med Chem21:592-607 (2013) 
 
Thyroid hormone receptor beta
Name:Thyroid hormone receptor beta
Type:Receptor
Mol. Mass.:52793.62
Organism:Homo sapiens (Human)
Description:Recombinant hThR was obtained from nuclear extracts from SF9 cells infected with baculovirus vectors encoding for ThRbeta 1.
Residue:461
BDBM50425399
NameBDBM50425399
Synonyms:CHEMBL2312269
TypeSmall organic molecule
Emp. Form.C27H25F2NO5
Mol. Mass.481.4879
SMILESCc1cc(NC(=O)CC(O)=O)c2CCCc2c1Oc1ccc(O)c(CCc2ccc(F)c(F)c2)c1