Reaction Details
TargetMu-type opioid receptor
LigandBDBM50425524
Substrate/Competitorn/a
Meas. Tech.ChEMBL_936065 (CHEMBL2319307)
Ki 37±n/a nM
Citation Bornot, ABauer, UBrown, AFirth, MHellawell, CEngkvist, O Systematic exploration of dual-acting modulators from a combined medicinal chemistry and biology perspective. J Med Chem56:1197-210 (2013) 
 
Mu-type opioid receptor
Name:Mu-type opioid receptor
Type:G Protein-Coupled Receptor (GPCR)
Mol. Mass.:44789.51
Organism:Homo sapiens (Human)
Description:P35372
Residue:400
BDBM50425524
NameBDBM50425524
Synonyms:CHEMBL2313628
TypeSmall organic molecule
Emp. Form.C26H31ClN4O2
Mol. Mass.467.003
SMILESCCC(=O)N(C1CCN(CCn2c3ccccc3n(C(C)=C)c2=O)CC1)c1cccc(Cl)c1