Reaction Details
TargetSubstance-P receptor
LigandBDBM50425524
Substrate/Competitorn/a
Meas. Tech.ChEMBL_936062 (CHEMBL2319304)
Ki 2.8±n/a nM
Citation Bornot, ABauer, UBrown, AFirth, MHellawell, CEngkvist, O Systematic exploration of dual-acting modulators from a combined medicinal chemistry and biology perspective. J Med Chem56:1197-210 (2013) 
 
Substance-P receptor
Name:Substance-P receptor
Type:G Protein-Coupled Receptor (GPCR)
Mol. Mass.:46254.43
Organism:Homo sapiens (Human)
Description:P25103
Residue:407
BDBM50425524
NameBDBM50425524
Synonyms:CHEMBL2313628
TypeSmall organic molecule
Emp. Form.C26H31ClN4O2
Mol. Mass.467.003
SMILESCCC(=O)N(C1CCN(CCn2c3ccccc3n(C(C)=C)c2=O)CC1)c1cccc(Cl)c1