Reaction Details
TargetAlbumin
LigandBDBM50425928
Substrate/Competitorn/a
Meas. Tech.ChEMBL_934194 (CHEMBL2319454)
IC50 30600±n/a nM
Citation Shantharam, CSSuyoga Vardhan, DMSuhas, RSridhara, MBGowda, DC Inhibition of protein glycation by urea and thiourea derivatives of glycine/proline conjugated benzisoxazole analogue - synthesis and structure-activity studies. Eur J Med Chem60:325-32 (2013) 
 
Albumin
Name:Albumin
Type:PROTEIN
Mol. Mass.:69288.15
Organism:Bos taurus
Description:ChEMBL_1502598
Residue:607
BDBM50425928
NameBDBM50425928
Synonyms:CHEMBL2313704
TypeSmall organic molecule
Emp. Form.C25H27FN4O4
Mol. Mass.466.5047
SMILESCOc1ccccc1NC(=O)N1CCCC1C(=O)N1CCC(CC1)c1noc2cc(F)ccc12