Reaction Details
TargetAlbumin
LigandBDBM50425931
Substrate/Competitorn/a
Meas. Tech.ChEMBL_934194 (CHEMBL2319454)
IC50 8500±n/a nM
Citation Shantharam, CSSuyoga Vardhan, DMSuhas, RSridhara, MBGowda, DC Inhibition of protein glycation by urea and thiourea derivatives of glycine/proline conjugated benzisoxazole analogue - synthesis and structure-activity studies. Eur J Med Chem60:325-32 (2013) 
 
Albumin
Name:Albumin
Type:PROTEIN
Mol. Mass.:69288.15
Organism:Bos taurus
Description:ChEMBL_1502598
Residue:607
BDBM50425931
NameBDBM50425931
Synonyms:CHEMBL2313730
TypeSmall organic molecule
Emp. Form.C21H20BrFN4O3
Mol. Mass.475.311
SMILESFc1ccc2c(noc2c1)C1CCN(CC1)C(=O)CNC(=O)Nc1ccc(Br)cc1