Reaction Details
TargetAlbumin
LigandBDBM50425937
Substrate/Competitorn/a
Meas. Tech.ChEMBL_934194 (CHEMBL2319454)
IC50 70300±n/a nM
Citation Shantharam, CSSuyoga Vardhan, DMSuhas, RSridhara, MBGowda, DC Inhibition of protein glycation by urea and thiourea derivatives of glycine/proline conjugated benzisoxazole analogue - synthesis and structure-activity studies. Eur J Med Chem60:325-32 (2013) 
 
Albumin
Name:Albumin
Type:PROTEIN
Mol. Mass.:69288.15
Organism:Bos taurus
Description:ChEMBL_1502598
Residue:607
BDBM50425937
NameBDBM50425937
Synonyms:CHEMBL2313722
TypeSmall organic molecule
Emp. Form.C21H20F2N4O2S
Mol. Mass.430.471
SMILESFc1ccc(NC(=S)NCC(=O)N2CCC(CC2)c2noc3cc(F)ccc23)cc1