Reaction Details
TargetInduced myeloid leukemia cell differentiation protein Mcl-1
LigandBDBM50425961
Substrate/Competitorn/a
Meas. Tech.ChEMBL_934367 (CHEMBL2320595)
Ki 10410±n/a nM
Citation Zhang, ZLiu, CLi, XSong, TWu, ZLiang, XZhao, YShen, XChen, H Fragment-based design, synthesis, and biological evaluation of N-substituted-5-(4-isopropylthiophenol)-2-hydroxynicotinamide derivatives as novel Mcl-1 inhibitors. Eur J Med Chem60:410-20 (2013) 
 
Induced myeloid leukemia cell differentiation protein Mcl-1
Name:Induced myeloid leukemia cell differentiation protein Mcl-1
Type:Membrane; Single-pass membrane protein
Mol. Mass.:37332.87
Organism:Homo sapiens (Human)
Description:Q07820
Residue:350
BDBM50425961
NameBDBM50425961
Synonyms:CHEMBL1539493
TypeSmall organic molecule
Emp. Form.C12H8N2O
Mol. Mass.196.2047
SMILESO=c1[nH]cc(cc1C#N)-c1ccccc1