Reaction Details
TargetThioredoxin
LigandBDBM50426062
Substrate/Competitorn/a
Meas. Tech.ChEMBL_934906 (CHEMBL2319792)
IC50 540±n/a nM
Citation DiRaimondo, TRPlugis, NMJin, XKhosla, C Selective inhibition of extracellular thioredoxin by asymmetric disulfides. J Med Chem56:1301-10 (2013) 
 
Thioredoxin
Name:Thioredoxin
Type:PROTEIN
Mol. Mass.:11732.84
Organism:Homo sapiens (Human)
Description:ChEMBL_934906
Residue:105
BDBM50426062
NameBDBM50426062
Synonyms:CHEMBL2315288
TypeSmall organic molecule
Emp. Form.C14H18N4S2
Mol. Mass.306.45
SMILESNn1c(SSC2CCCCC2)nnc1-c1ccccc1