Reaction Details
TargetThioredoxin
LigandBDBM50426063
Substrate/Competitorn/a
Meas. Tech.ChEMBL_934906 (CHEMBL2319792)
IC50 450±n/a nM
Citation DiRaimondo, TRPlugis, NMJin, XKhosla, C Selective inhibition of extracellular thioredoxin by asymmetric disulfides. J Med Chem56:1301-10 (2013) 
 
Thioredoxin
Name:Thioredoxin
Type:PROTEIN
Mol. Mass.:11732.84
Organism:Homo sapiens (Human)
Description:ChEMBL_934906
Residue:105
BDBM50426063
NameBDBM50426063
Synonyms:CHEMBL2315290
TypeSmall organic molecule
Emp. Form.C15H18N2S2
Mol. Mass.290.447
SMILESC1CCC(CC1)SSc1nc(c[nH]1)-c1ccccc1