Reaction Details
TargetThioredoxin
LigandBDBM50426064
Substrate/Competitorn/a
Meas. Tech.ChEMBL_934906 (CHEMBL2319792)
IC50 290±n/a nM
Citation DiRaimondo, TRPlugis, NMJin, XKhosla, C Selective inhibition of extracellular thioredoxin by asymmetric disulfides. J Med Chem56:1301-10 (2013) 
 
Thioredoxin
Name:Thioredoxin
Type:PROTEIN
Mol. Mass.:11732.84
Organism:Homo sapiens (Human)
Description:ChEMBL_934906
Residue:105
BDBM50426064
NameBDBM50426064
Synonyms:CHEMBL2315292
TypeSmall organic molecule
Emp. Form.C11H15N5OS2
Mol. Mass.297.4
SMILESNc1nc2nc(SSC3CCCCC3)[nH]c2c(=O)[nH]1