Reaction Details
TargetThioredoxin
LigandBDBM50426067
Substrate/Competitorn/a
Meas. Tech.ChEMBL_934906 (CHEMBL2319792)
IC50 170±n/a nM
Citation DiRaimondo, TRPlugis, NMJin, XKhosla, C Selective inhibition of extracellular thioredoxin by asymmetric disulfides. J Med Chem56:1301-10 (2013) 
 
Thioredoxin
Name:Thioredoxin
Type:PROTEIN
Mol. Mass.:11732.84
Organism:Homo sapiens (Human)
Description:ChEMBL_934906
Residue:105
BDBM50426067
NameBDBM50426067
Synonyms:CHEMBL2315297
TypeSmall organic molecule
Emp. Form.C13H14ClFN2S2
Mol. Mass.316.845
SMILESFc1cc2[nH]c(SSC3CCCCC3)nc2cc1Cl