Reaction Details
TargetThioredoxin
LigandBDBM50426069
Substrate/Competitorn/a
Meas. Tech.ChEMBL_934906 (CHEMBL2319792)
IC50 7310±n/a nM
Citation DiRaimondo, TRPlugis, NMJin, XKhosla, C Selective inhibition of extracellular thioredoxin by asymmetric disulfides. J Med Chem56:1301-10 (2013) 
 
Thioredoxin
Name:Thioredoxin
Type:PROTEIN
Mol. Mass.:11732.84
Organism:Homo sapiens (Human)
Description:ChEMBL_934906
Residue:105
BDBM50426069
NameBDBM50426069
Synonyms:CHEMBL2315305
TypeSmall organic molecule
Emp. Form.C11H14N2S2
Mol. Mass.238.372
SMILESCC(C)(C)SSc1nc2ccccc2[nH]1