Reaction Details
TargetThioredoxin
LigandBDBM50426070
Substrate/Competitorn/a
Meas. Tech.ChEMBL_934906 (CHEMBL2319792)
IC50 340±n/a nM
Citation DiRaimondo, TRPlugis, NMJin, XKhosla, C Selective inhibition of extracellular thioredoxin by asymmetric disulfides. J Med Chem56:1301-10 (2013) 
 
Thioredoxin
Name:Thioredoxin
Type:PROTEIN
Mol. Mass.:11732.84
Organism:Homo sapiens (Human)
Description:ChEMBL_934906
Residue:105
BDBM50426070
NameBDBM50426070
Synonyms:CHEMBL2315306
TypeSmall organic molecule
Emp. Form.C9H10N2S2
Mol. Mass.210.319
SMILESCCSSc1nc2ccccc2[nH]1