Reaction Details
TargetThioredoxin
LigandBDBM50426071
Substrate/Competitorn/a
Meas. Tech.ChEMBL_934906 (CHEMBL2319792)
IC50 2110±n/a nM
Citation DiRaimondo, TRPlugis, NMJin, XKhosla, C Selective inhibition of extracellular thioredoxin by asymmetric disulfides. J Med Chem56:1301-10 (2013) 
 
Thioredoxin
Name:Thioredoxin
Type:PROTEIN
Mol. Mass.:11732.84
Organism:Homo sapiens (Human)
Description:ChEMBL_934906
Residue:105
BDBM50426071
NameBDBM50426071
Synonyms:CHEMBL406050 US9018255, PX-12 | med.21724, Compound 156
TypeSmall organic molecule
Emp. Form.C7H12N2S2
Mol. Mass.188.314
SMILESCCC(C)SSc1ncc[nH]1