Reaction Details
TargetCannabinoid receptor 1
LigandBDBM50426090
Substrate/Competitorn/a
Meas. Tech.ChEMBL_935498 (CHEMBL2319557)
Ki>10000±n/a nM
Citation Aghazadeh Tabrizi, MBaraldi, PGSaponaro, GMoorman, ARRomagnoli, RPreti, DBaraldi, SCorciulo, CVincenzi, FBorea, PAVarani, K Design, synthesis, and pharmacological properties of new heteroarylpyridine/heteroarylpyrimidine derivatives as CB(2) cannabinoid receptor partial agonists. J Med Chem56:1098-112 (2013) 
 
Cannabinoid receptor 1
Name:Cannabinoid receptor 1
Type:G Protein-Coupled Receptor (GPCR)
Mol. Mass.:52856.55
Organism:Rattus norvegicus (rat)
Description:P20272
Residue:473
BDBM50426090
NameBDBM50426090
Synonyms:CHEMBL2316277
TypeSmall organic molecule
Emp. Form.C25H31ClN4O2
Mol. Mass.454.992
SMILESCCCCCn1cc(C(=O)NC2CCCCC2)c(=O)c2c(nn(C)c12)-c1ccc(Cl)cc1