Reaction Details
TargetCannabinoid receptor 1
LigandBDBM50426102
Substrate/Competitorn/a
Meas. Tech.ChEMBL_935498 (CHEMBL2319557)
Ki>10000±n/a nM
Citation Aghazadeh Tabrizi, MBaraldi, PGSaponaro, GMoorman, ARRomagnoli, RPreti, DBaraldi, SCorciulo, CVincenzi, FBorea, PAVarani, K Design, synthesis, and pharmacological properties of new heteroarylpyridine/heteroarylpyrimidine derivatives as CB(2) cannabinoid receptor partial agonists. J Med Chem56:1098-112 (2013) 
 
Cannabinoid receptor 1
Name:Cannabinoid receptor 1
Type:G Protein-Coupled Receptor (GPCR)
Mol. Mass.:52856.55
Organism:Rattus norvegicus (rat)
Description:P20272
Residue:473
BDBM50426102
NameBDBM50426102
Synonyms:CHEMBL2316265
TypeSmall organic molecule
Emp. Form.C21H26N4O3
Mol. Mass.382.4561
SMILESCCCCCn1cc(C(=O)Nc2ccc(OC)cc2)c(=O)c2c(C)nn(C)c12