Reaction Details
TargetCannabinoid receptor 2
LigandBDBM50426089
Substrate/Competitorn/a
Meas. Tech.ChEMBL_935496 (CHEMBL2319555)
Ki 4050±n/a nM
Citation Aghazadeh Tabrizi, MBaraldi, PGSaponaro, GMoorman, ARRomagnoli, RPreti, DBaraldi, SCorciulo, CVincenzi, FBorea, PAVarani, K Design, synthesis, and pharmacological properties of new heteroarylpyridine/heteroarylpyrimidine derivatives as CB(2) cannabinoid receptor partial agonists. J Med Chem56:1098-112 (2013) 
 
Cannabinoid receptor 2
Name:Cannabinoid receptor 2
Type:Enzyme
Mol. Mass.:39366.68
Organism:Rattus norvegicus (Rat)
Description:Q9QZN9
Residue:360
BDBM50426089
NameBDBM50426089
Synonyms:CHEMBL2316278
TypeSmall organic molecule
Emp. Form.C26H33ClN4O2
Mol. Mass.469.019
SMILESCCCCCn1cc(C(=O)NC2CCCCCC2)c(=O)c2c(nn(C)c12)-c1ccc(Cl)cc1