Reaction Details
TargetCannabinoid receptor 2
LigandBDBM50426115
Substrate/Competitorn/a
Meas. Tech.ChEMBL_935496 (CHEMBL2319555)
Ki>10000±n/a nM
Citation Aghazadeh Tabrizi, MBaraldi, PGSaponaro, GMoorman, ARRomagnoli, RPreti, DBaraldi, SCorciulo, CVincenzi, FBorea, PAVarani, K Design, synthesis, and pharmacological properties of new heteroarylpyridine/heteroarylpyrimidine derivatives as CB(2) cannabinoid receptor partial agonists. J Med Chem56:1098-112 (2013) 
 
Cannabinoid receptor 2
Name:Cannabinoid receptor 2
Type:Enzyme
Mol. Mass.:39366.68
Organism:Rattus norvegicus (Rat)
Description:Q9QZN9
Residue:360
BDBM50426115
NameBDBM50426115
Synonyms:CHEMBL2316290
TypeSmall organic molecule
Emp. Form.C20H27N5O2
Mol. Mass.369.4607
SMILESCc1nn(C)c2n(CCCCC#N)cc(C(=O)NC3CCCCC3)c(=O)c12