Reaction Details
TargetCannabinoid receptor 2
LigandBDBM50426085
Substrate/Competitorn/a
Meas. Tech.ChEMBL_935219 (CHEMBL2317841)
EC50 107±n/a nM
Citation Aghazadeh Tabrizi, MBaraldi, PGSaponaro, GMoorman, ARRomagnoli, RPreti, DBaraldi, SCorciulo, CVincenzi, FBorea, PAVarani, K Design, synthesis, and pharmacological properties of new heteroarylpyridine/heteroarylpyrimidine derivatives as CB(2) cannabinoid receptor partial agonists. J Med Chem56:1098-112 (2013) 
 
Cannabinoid receptor 2
Name:Cannabinoid receptor 2
Type:G Protein-Coupled Receptor (GPCR)
Mol. Mass.:39690.94
Organism:Homo sapiens (Human)
Description:P34972
Residue:360
BDBM50426085
NameBDBM50426085
Synonyms:CHEMBL2316282
TypeSmall organic molecule
Emp. Form.C20H28N2O2S
Mol. Mass.360.514
SMILESCCCCCn1cc(C(=O)NC2CCCCC2)c(=O)c2c(C)csc12