Reaction Details
TargetCannabinoid receptor 1
LigandBDBM50426094
Substrate/Competitorn/a
Meas. Tech.ChEMBL_935497 (CHEMBL2319556)
Ki 4550±n/a nM
Citation Aghazadeh Tabrizi, MBaraldi, PGSaponaro, GMoorman, ARRomagnoli, RPreti, DBaraldi, SCorciulo, CVincenzi, FBorea, PAVarani, K Design, synthesis, and pharmacological properties of new heteroarylpyridine/heteroarylpyrimidine derivatives as CB(2) cannabinoid receptor partial agonists. J Med Chem56:1098-112 (2013) 
 
Cannabinoid receptor 1
Name:Cannabinoid receptor 1
Type:G Protein-Coupled Receptor (GPCR)
Mol. Mass.:52868.96
Organism:Homo sapiens (Human)
Description:P21554
Residue:472
BDBM50426094
NameBDBM50426094
Synonyms:CHEMBL2316273
TypeSmall organic molecule
Emp. Form.C20H30N4O2
Mol. Mass.358.4778
SMILESCCCCCn1cc(C(=O)NC2CCCCCC2)c(=O)c2cnn(C)c12