Reaction Details
TargetCannabinoid receptor 1
LigandBDBM50426100
Substrate/Competitorn/a
Meas. Tech.ChEMBL_935497 (CHEMBL2319556)
Ki>10000±n/a nM
Citation Aghazadeh Tabrizi, MBaraldi, PGSaponaro, GMoorman, ARRomagnoli, RPreti, DBaraldi, SCorciulo, CVincenzi, FBorea, PAVarani, K Design, synthesis, and pharmacological properties of new heteroarylpyridine/heteroarylpyrimidine derivatives as CB(2) cannabinoid receptor partial agonists. J Med Chem56:1098-112 (2013) 
 
Cannabinoid receptor 1
Name:Cannabinoid receptor 1
Type:G Protein-Coupled Receptor (GPCR)
Mol. Mass.:52868.96
Organism:Homo sapiens (Human)
Description:P21554
Residue:472
BDBM50426100
NameBDBM50426100
Synonyms:CHEMBL2316267
TypeSmall organic molecule
Emp. Form.C21H26N4O2
Mol. Mass.366.4567
SMILESCCCCCn1cc(C(=O)NCc2ccccc2)c(=O)c2c(C)nn(C)c12