Reaction Details
TargetCannabinoid receptor 2
LigandBDBM50426086
Substrate/Competitorn/a
Meas. Tech.ChEMBL_935495 (CHEMBL2319554)
Ki 21±n/a nM
Citation Aghazadeh Tabrizi, MBaraldi, PGSaponaro, GMoorman, ARRomagnoli, RPreti, DBaraldi, SCorciulo, CVincenzi, FBorea, PAVarani, K Design, synthesis, and pharmacological properties of new heteroarylpyridine/heteroarylpyrimidine derivatives as CB(2) cannabinoid receptor partial agonists. J Med Chem56:1098-112 (2013) 
 
Cannabinoid receptor 2
Name:Cannabinoid receptor 2
Type:G Protein-Coupled Receptor (GPCR)
Mol. Mass.:39690.94
Organism:Homo sapiens (Human)
Description:P34972
Residue:360
BDBM50426086
NameBDBM50426086
Synonyms:CHEMBL2316281
TypeSmall organic molecule
Emp. Form.C23H31N3O3
Mol. Mass.397.5105
SMILESCCCCCn1cc(C(=O)NC23CC4CC(CC(C4)C2)C3)c(=O)c2c(C)noc12