Reaction Details
TargetCannabinoid receptor 2
LigandBDBM50426104
Substrate/Competitorn/a
Meas. Tech.ChEMBL_935495 (CHEMBL2319554)
Ki 212±n/a nM
Citation Aghazadeh Tabrizi, MBaraldi, PGSaponaro, GMoorman, ARRomagnoli, RPreti, DBaraldi, SCorciulo, CVincenzi, FBorea, PAVarani, K Design, synthesis, and pharmacological properties of new heteroarylpyridine/heteroarylpyrimidine derivatives as CB(2) cannabinoid receptor partial agonists. J Med Chem56:1098-112 (2013) 
 
Cannabinoid receptor 2
Name:Cannabinoid receptor 2
Type:G Protein-Coupled Receptor (GPCR)
Mol. Mass.:39690.94
Organism:Homo sapiens (Human)
Description:P34972
Residue:360
BDBM50426104
NameBDBM50426104
Synonyms:CHEMBL2316301
TypeSmall organic molecule
Emp. Form.C21H34N4O2
Mol. Mass.374.5203
SMILESCCCCCn1cc(C(=O)NC(C)CCC(C)C)c(=O)c2c(C)nn(C)c12