Reaction Details
TargetCasein kinase I isoform alpha
LigandBDBM50426335
Substrate/Competitorn/a
Meas. Tech.ChEMBL_939731 (CHEMBL2329084)
IC50 4200±n/a nM
Citation Myrianthopoulos, VKritsanida, MGaboriaud-Kolar, NMagiatis, PFerandin, YDurieu, ELozach, OCappel, DSoundararajan, MFilippakopoulos, PSherman, WKnapp, SMeijer, LMikros, ESkaltsounis, AL Novel Inverse Binding Mode of Indirubin Derivatives Yields Improved Selectivity for DYRK Kinases. ACS Med Chem Lett4:22-26 (2013) 
 
Casein kinase I isoform alpha
Name:Casein kinase I isoform alpha
Type:PROTEIN
Mol. Mass.:14639.55
Organism:Sus scrofa
Description:ChEMBL_939731
Residue:125
BDBM50426335
NameBDBM50426335
Synonyms:CHEMBL2321878
TypeSmall organic molecule
Emp. Form.C18H10F3N3O4
Mol. Mass.389.2849
SMILESOC(=O)c1ccc2[nH]c(C3C(=O)Nc4c3cccc4C(F)(F)F)c(N=O)c2c1