Reaction Details
TargetCasein kinase I isoform alpha
LigandBDBM50426310
Substrate/Competitorn/a
Meas. Tech.ChEMBL_939731 (CHEMBL2329084)
IC50 580±n/a nM
Citation Myrianthopoulos, VKritsanida, MGaboriaud-Kolar, NMagiatis, PFerandin, YDurieu, ELozach, OCappel, DSoundararajan, MFilippakopoulos, PSherman, WKnapp, SMeijer, LMikros, ESkaltsounis, AL Novel Inverse Binding Mode of Indirubin Derivatives Yields Improved Selectivity for DYRK Kinases. ACS Med Chem Lett4:22-26 (2013) 
 
Casein kinase I isoform alpha
Name:Casein kinase I isoform alpha
Type:PROTEIN
Mol. Mass.:14639.55
Organism:Sus scrofa
Description:ChEMBL_939731
Residue:125
BDBM50426310
NameBDBM50426310
Synonyms:CHEMBL2321967
TypeSmall organic molecule
Emp. Form.C18H12N2O4
Mol. Mass.320.2989
SMILESCOC(=O)c1ccc2N\C(C(=O)c2c1)=C1/C(=O)Nc2ccccc12