Reaction Details
TargetGlycogen synthase kinase-3 beta
LigandBDBM50426336
Substrate/Competitorn/a
Meas. Tech.ChEMBL_939732 (CHEMBL2329085)
IC50 70±n/a nM
Citation Myrianthopoulos, VKritsanida, MGaboriaud-Kolar, NMagiatis, PFerandin, YDurieu, ELozach, OCappel, DSoundararajan, MFilippakopoulos, PSherman, WKnapp, SMeijer, LMikros, ESkaltsounis, AL Novel Inverse Binding Mode of Indirubin Derivatives Yields Improved Selectivity for DYRK Kinases. ACS Med Chem Lett4:22-26 (2013) 
 
Glycogen synthase kinase-3 beta
Name:Glycogen synthase kinase-3 beta
Type:PROTEIN
Mol. Mass.:46774.42
Organism:Sus scrofa
Description:ChEMBL_939732
Residue:420
BDBM50426336
NameBDBM50426336
Synonyms:CHEMBL2321952
TypeSmall organic molecule
Emp. Form.C17H11N3O4
Mol. Mass.321.2869
SMILESOC(=O)c1ccc2[nH]c(C3C(=O)Nc4ccccc34)c(N=O)c2c1