Reaction Details
TargetDual specificity tyrosine-phosphorylation-regulated kinase 2
LigandBDBM50426336
Substrate/Competitorn/a
Meas. Tech.ChEMBL_939729 (CHEMBL2329082)
IC50 350±n/a nM
Citation Myrianthopoulos, VKritsanida, MGaboriaud-Kolar, NMagiatis, PFerandin, YDurieu, ELozach, OCappel, DSoundararajan, MFilippakopoulos, PSherman, WKnapp, SMeijer, LMikros, ESkaltsounis, AL Novel Inverse Binding Mode of Indirubin Derivatives Yields Improved Selectivity for DYRK Kinases. ACS Med Chem Lett4:22-26 (2013) 
 
Dual specificity tyrosine-phosphorylation-regulated kinase 2
Name:Dual specificity tyrosine-phosphorylation-regulated kinase 2
Type:PROTEIN
Mol. Mass.:66690.69
Organism:Homo sapiens (Human)
Description:ChEMBL_1508025
Residue:601
BDBM50426336
NameBDBM50426336
Synonyms:CHEMBL2321952
TypeSmall organic molecule
Emp. Form.C17H11N3O4
Mol. Mass.321.2869
SMILESOC(=O)c1ccc2[nH]c(C3C(=O)Nc4ccccc34)c(N=O)c2c1