Reaction Details
TargetCell division cycle 7-related protein kinase
LigandBDBM50426472
Substrate/Competitorn/a
Meas. Tech.ChEMBL_940355 (CHEMBL2328973)
Ki 8.7±n/a nM
Citation Tong, YStewart, KDFlorjancic, ASHarlan, JEMerta, PJPrzytulinska, MSoni, NSwinger, KKZhu, HJohnson, EFShoemaker, ARPenning, TD Azaindole-Based Inhibitors of Cdc7 Kinase: Impact of the Pre-DFG Residue, Val 195. ACS Med Chem Lett4:211-5 (2013) 
 
Cell division cycle 7-related protein kinase
Name:Cell division cycle 7-related protein kinase
Type:Protein
Mol. Mass.:63908.16
Organism:Homo sapiens (Human)
Description:O00311
Residue:574
BDBM50426472
NameBDBM50426472
Synonyms:CHEMBL2322678
TypeSmall organic molecule
Emp. Form.C18H20N4
Mol. Mass.292.3782
SMILESC1CCC(CC1)Nc1cc(ccn1)-c1c[nH]c2ncccc12