Reaction Details
TargetAcetyl-CoA carboxylase 1
LigandBDBM50426523
Substrate/Competitorn/a
Meas. Tech.ChEMBL_938403 (CHEMBL2329346)
IC50 5.0±n/a nM
Citation Abdel-Magid, AF Treatment of Obesity and Related Disorders with Acetyl-CoA Carboxylase Inhibitors. ACS Med Chem Lett4:16-7 (2013) 
 
Acetyl-CoA carboxylase 1
Name:Acetyl-CoA carboxylase 1
Type:Protein
Mol. Mass.:265543.22
Organism:Homo sapiens (Human)
Description:Q13085
Residue:2346
BDBM50426523
NameBDBM50426523
Synonyms:CHEMBL2323628
TypeSmall organic molecule
Emp. Form.C25H28N4O3
Mol. Mass.432.5148
SMILESCOc1ccc2ncc(cc2c1)C(=O)N1CCC2(CC1)Cc1cnn(C(C)C)c1C(=O)C2