Reaction Details
TargetCaspase-4
LigandBDBM50426566
Substrate/Competitorn/a
Meas. Tech.ChEMBL_938632 (CHEMBL2327252)
IC50 510±n/a nM
Citation Rosse, G Irreversible inhibitors of cysteine proteases. ACS Med Chem Lett4:163-4 (2013) 
 
Caspase-4
Name:Caspase-4
Type:Enzyme
Mol. Mass.:43257.75
Organism:Homo sapiens (Human)
Description:P49662
Residue:377
BDBM50426566
NameBDBM50426566
Synonyms:CHEMBL2324341
TypeSmall organic molecule
Emp. Form.C33H40N4O11
Mol. Mass.668.6909
SMILESCCOC(=O)\C=C\[C@H](CC(O)=O)NC(=O)[C@@H](NC(=O)[C@@H](NC(=O)[C@H](CC(O)=O)NC(=O)OCc1ccccc1)c1ccccc1)C(C)C