Reaction Details
TargetGalanin receptor type 1
LigandBDBM50426597
Substrate/Competitorn/a
Meas. Tech.ChEMBL_938964 (CHEMBL2328546)
Ki 3.8±n/a nM
Citation Green, BRKlein, BDLee, HKSmith, MDSteve White, HBulaj, G Cyclic analogs of galanin and neuropeptide Y by hydrocarbon stapling. Bioorg Med Chem21:303-10 (2012) 
 
Galanin receptor type 1
Name:Galanin receptor type 1
Type:Enzyme Catalytic Domain
Mol. Mass.:38976.60
Organism:Homo sapiens (Human)
Description:Galanin R1 GALR1 HUMAN::P47211
Residue:349
BDBM50426597
NameBDBM50426597
Synonyms:CHEMBL2324950
TypeSmall organic molecule
Emp. Form.C102H166N26O23
Mol. Mass.2124.5698
SMILESCNCC(=O)N[C@@H](Cc1c[nH]c2ccccc12)C(=O)N[C@@H]([C@@H](C)O)C(=O)N[C@@H](CC(C)C)C(=O)N[C@@H](CC(N)=O)C(=O)N[C@@H](CO)C(=O)N[C@@H](C)C(=O)NCC(=O)N[C@@H](Cc1ccc(O)cc1)C(=O)N[C@@H](CC(C)C)C(=O)N[C@@H](CC(C)C)C(=O)NCC(=O)N1CCC[C@H]1C(=O)N[C@@]1(C)CCC\C=C/CCC[C@](C)(NC(=O)[C@H](CCCCN)NC(=O)[C@H](CCCCN)NC(=O)[C@H](CCCCN)NC1=O)C(=O)N[C@@H](CCCCN)C(N)=O