Reaction Details
TargetAlpha-1A adrenergic receptor
LigandBDBM50426621
Substrate/Competitorn/a
Meas. Tech.ChEMBL_939354 (CHEMBL2327489)
Ki 0.280000±n/a nM
Citation Jørgensen, MJørgensen, PNChristoffersen, CTJensen, KGBalle, TBang-Andersen, B Discovery of novela1-adrenoceptor ligands based on the antipsychotic sertindole suitable for labeling as PET ligands. Bioorg Med Chem21:196-204 (2012) 
 
Alpha-1A adrenergic receptor
Name:Alpha-1A adrenergic receptor
Type:Enzyme Catalytic Domain
Mol. Mass.:51492.08
Organism:CALF
Description:adrenergic Alpha1 0 CALF
Residue:466
BDBM50426621
NameBDBM50426621
Synonyms:CHEMBL2325935
TypeSmall organic molecule
Emp. Form.C22H23FN6
Mol. Mass.390.4566
SMILESCN1CCC(CC1)c1cn(-c2ccc(F)cc2)c2ccc(cc12)-c1nnn(C)n1