Reaction Details
TargetMelatonin receptor type 1B
LigandBDBM50426656
Substrate/Competitorn/a
Meas. Tech.ChEMBL_939502 (CHEMBL2328137)
Ki 0.073000±n/a nM
Citation Hu, YZhu, JChan, KHWong, YH Development of substituted N-[3-(3-methoxylphenyl)propyl] amides as MT(2)-selective melatonin agonists: improving metabolic stability. Bioorg Med Chem21:547-52 (2012) 
 
Melatonin receptor type 1B
Name:Melatonin receptor type 1B
Type:Enzyme
Mol. Mass.:40203.54
Organism:Homo sapiens (Human)
Description:P49286
Residue:362
BDBM50426656
NameBDBM50426656
Synonyms:CHEMBL2326200
TypeSmall organic molecule
Emp. Form.C22H25NO3
Mol. Mass.351.4388
SMILESCCC(=O)NCCCc1cc(OC)ccc1C#Cc1cccc(OC)c1