Reaction Details
TargetFatty-acid amide hydrolase 1
LigandBDBM50426691
Substrate/Competitorn/a
Meas. Tech.ChEMBL_939830 (CHEMBL2329423)
Ki>500±n/a nM
Citation Butini, SGemma, SBrindisi, MMaramai, SMinetti, PCelona, DNapolitano, RBorsini, FCabri, WFezza, FMerlini, LDallavalle, SCampiani, GMaccarrone, M Identification of a novel arylpiperazine scaffold for fatty acid amide hydrolase inhibition with improved drug disposition properties. Bioorg Med Chem Lett23:492-5 (2012) 
 
Fatty-acid amide hydrolase 1
Name:Fatty-acid amide hydrolase 1
Type:Hydrolase; single-pass membrane protein; homodimer
Mol. Mass.:63227.28
Organism:Mus musculus (mouse)
Description:Mouse brain membranes were used in the assay.
Residue:579
BDBM50426691
NameBDBM50426691
Synonyms:CHEMBL2326496
TypeSmall organic molecule
Emp. Form.C28H35N5O2
Mol. Mass.473.6098
SMILESNC(=O)c1ccn(c1)-c1cccc(c1)N1CCN(CC1)C(=O)NCCCCCCc1ccccc1