Reaction Details
TargetAdenosine receptor A3
LigandBDBM50364045
Substrate/Competitorn/a
Meas. Tech.ChEMBL_940035 (CHEMBL2327844)
Ki 53±n/a nM
Citation El-Tayeb, AGollos, S Synthesis and structure-activity relationships of 2-hydrazinyladenosine derivatives as A(2A) adenosine receptor ligands. Bioorg Med Chem21:436-47 (2012) 
 
Adenosine receptor A3
Name:Adenosine receptor A3
Type:G Protein-Coupled Receptor (GPCR)
Mol. Mass.:36197.32
Organism:Homo sapiens (Human)
Description:P0DMS8
Residue:318
BDBM50364045
NameBDBM50364045
Synonyms:CHEMBL1950554
TypeSmall organic molecule
Emp. Form.C17H25N7O4
Mol. Mass.391.4249
SMILESNc1nc(N=NCC2CCCCC2)nc2n(cnc12)[C@@H]1O[C@H](CO)[C@@H](O)[C@H]1O