Reaction Details
TargetTyrosine-protein kinase JAK2
LigandBDBM50426734
Substrate/Competitorn/a
Meas. Tech.ChEMBL_940565 (CHEMBL2327339)
EC50 4800±n/a nM
Citation Van Epps, SFiamengo, BEdmunds, JEricsson, AFrank, KFriedman, MGeorge, DGeorge, JGoedken, EKotecki, BMartinez, GMerta, PMorytko, MShekhar, SSkinner, BStewart, KVoss, JWallace, GWang, LWang, LWishart, N Design and synthesis of tricyclic cores for kinase inhibition. Bioorg Med Chem Lett23:693-8 (2013) 
 
Tyrosine-protein kinase JAK2
Name:Tyrosine-protein kinase JAK2
Type:Protein
Mol. Mass.:130684.68
Organism:Homo sapiens (Human)
Description:O60674
Residue:1132
BDBM50426734
NameBDBM50426734
Synonyms:CHEMBL2322142
TypeSmall organic molecule
Emp. Form.C14H16N4
Mol. Mass.240.3036
SMILESC1CCC(CC1)c1cnc2cnc3[nH]ccc3n12