Reaction Details
TargetVascular endothelial growth factor receptor 2
LigandBDBM50426731
Substrate/Competitorn/a
Meas. Tech.ChEMBL_940570 (CHEMBL2327344)
IC50 3700±n/a nM
Citation Van Epps, SFiamengo, BEdmunds, JEricsson, AFrank, KFriedman, MGeorge, DGeorge, JGoedken, EKotecki, BMartinez, GMerta, PMorytko, MShekhar, SSkinner, BStewart, KVoss, JWallace, GWang, LWang, LWishart, N Design and synthesis of tricyclic cores for kinase inhibition. Bioorg Med Chem Lett23:693-8 (2013) 
 
Vascular endothelial growth factor receptor 2
Name:Vascular endothelial growth factor receptor 2
Type:Receptor Tyrosine Kinase
Mol. Mass.:151510.97
Organism:Homo sapiens (Human)
Description:P35968
Residue:1356
BDBM50426731
NameBDBM50426731
Synonyms:1-cyclohexyl-1,6-dihydroimidazo[4,5-d]pyrrolo[2,3-b]pyridine (2) | CHEMBL2322138
TypeSmall organic molecule
Emp. Form.C14H16N4
Mol. Mass.240.3036
SMILESC1CCC(CC1)n1cnc2cnc3[nH]ccc3c12