Reaction Details
TargetVascular endothelial growth factor receptor 2
LigandBDBM50426735
Substrate/Competitorn/a
Meas. Tech.ChEMBL_940570 (CHEMBL2327344)
IC50 2600±n/a nM
Citation Van Epps, SFiamengo, BEdmunds, JEricsson, AFrank, KFriedman, MGeorge, DGeorge, JGoedken, EKotecki, BMartinez, GMerta, PMorytko, MShekhar, SSkinner, BStewart, KVoss, JWallace, GWang, LWang, LWishart, N Design and synthesis of tricyclic cores for kinase inhibition. Bioorg Med Chem Lett23:693-8 (2013) 
 
Vascular endothelial growth factor receptor 2
Name:Vascular endothelial growth factor receptor 2
Type:Receptor Tyrosine Kinase
Mol. Mass.:151510.97
Organism:Homo sapiens (Human)
Description:P35968
Residue:1356
BDBM50426735
NameBDBM50426735
Synonyms:CHEMBL2322141
TypeSmall organic molecule
Emp. Form.C13H15N5
Mol. Mass.241.2917
SMILESC1CCC(CC1)c1nnc2cnc3[nH]ccc3n12