Reaction Details
TargetReceptor-type tyrosine-protein kinase FLT3
LigandBDBM50426733
Substrate/Competitorn/a
Meas. Tech.ChEMBL_940572 (CHEMBL2327346)
IC50 150±n/a nM
Citation Van Epps, SFiamengo, BEdmunds, JEricsson, AFrank, KFriedman, MGeorge, DGeorge, JGoedken, EKotecki, BMartinez, GMerta, PMorytko, MShekhar, SSkinner, BStewart, KVoss, JWallace, GWang, LWang, LWishart, N Design and synthesis of tricyclic cores for kinase inhibition. Bioorg Med Chem Lett23:693-8 (2013) 
 
Receptor-type tyrosine-protein kinase FLT3
Name:Receptor-type tyrosine-protein kinase FLT3
Type:Enzyme
Mol. Mass.:112888.62
Organism:Homo sapiens (Human)
Description:P36888
Residue:993
BDBM50426733
NameBDBM50426733
Synonyms:CHEMBL2322143
TypeSmall organic molecule
Emp. Form.C15H17N3
Mol. Mass.239.3156
SMILESC1CCC(CC1)c1ccc2cnc3[nH]ccc3n12