Reaction Details
TargetAurora kinase A
LigandBDBM50426739
Substrate/Competitorn/a
Meas. Tech.ChEMBL_940573 (CHEMBL2327347)
IC50 130±n/a nM
Citation Van Epps, SFiamengo, BEdmunds, JEricsson, AFrank, KFriedman, MGeorge, DGeorge, JGoedken, EKotecki, BMartinez, GMerta, PMorytko, MShekhar, SSkinner, BStewart, KVoss, JWallace, GWang, LWang, LWishart, N Design and synthesis of tricyclic cores for kinase inhibition. Bioorg Med Chem Lett23:693-8 (2013) 
 
Aurora kinase A
Name:Aurora kinase A
Type:Serine/threonine-protein kinase
Mol. Mass.:45830.98
Organism:Homo sapiens (Human)
Description:O14965
Residue:403
BDBM50426739
NameBDBM50426739
Synonyms:CHEMBL2322135
TypeSmall organic molecule
Emp. Form.C14H16N4
Mol. Mass.240.3036
SMILESC1CCC(CC1)c1n[nH]c2cnc3[nH]ccc3c12