Reaction Details
TargetPhosphatidylinositol 4,5-bisphosphate 3-kinase catalytic subunit alpha isoform
LigandBDBM50315213
Substrate/Competitorn/a
Meas. Tech.ChEMBL_938157 (CHEMBL2328239)
IC50 6.0±n/a nM
Citation Miller, MSPinson, JAZheng, ZJennings, IGThompson, PE Regioselective synthesis of 5- and 6-methoxybenzimidazole-1,3,5-triazines as inhibitors of phosphoinositide 3-kinase. Bioorg Med Chem Lett23:802-5 (2013) 
 
Phosphatidylinositol 4,5-bisphosphate 3-kinase catalytic subunit alpha isoform
Name:Phosphatidylinositol 4,5-bisphosphate 3-kinase catalytic subunit alpha isoform
Type:Enzyme Subunit
Mol. Mass.:124294.87
Organism:Homo sapiens (Human)
Description:P42336
Residue:1068
BDBM50315213
NameBDBM50315213
Synonyms:2-(difluoromethyl)-1-(4,6-dimorpholin-4-yl-1,3,5-triazin-2-yl)-1H-benzimidazole CHEMBL586702 | TCMDC-137004
TypeSmall organic molecule
Emp. Form.C19H21F2N7O2
Mol. Mass.417.4125
SMILESFC(F)c1nc2ccccc2n1-c1nc(nc(n1)N1CCOCC1)N1CCOCC1