Reaction Details
TargetCarbonic anhydrase 12
LigandBDBM26187
Substrate/Competitorn/a
Meas. Tech.ChEMBL_938159 (CHEMBL2328241)
Ki 9200±n/a nM
Citation Bozdag, MDreker, THenry, CTosco, PVallaro, MFruttero, RScozzafava, ACarta, FSupuran, CT Novel small molecule protein arginine deiminase 4 (PAD4) inhibitors. Bioorg Med Chem Lett23:715-9 (2013) 
 
Carbonic anhydrase 12
Name:Carbonic anhydrase 12
Type:Enzyme
Mol. Mass.:39456.00
Organism:Homo sapiens (Human)
Description:Catalytic domain of human cloned isozyme was used in the assay
Residue:354
BDBM26187
NameBDBM26187
Synonyms:α-CA inhibitor, 11 US9688816, 2 | phenol
TypeSmall organic molecule
Emp. Form.C6H6O
Mol. Mass.94.1112
SMILESOc1ccccc1