Reaction Details
TargetCarbonic anhydrase 9
LigandBDBM50014341
Substrate/Competitorn/a
Meas. Tech.ChEMBL_938158 (CHEMBL2328240)
Ki 2560±n/a nM
Citation Bozdag, MDreker, THenry, CTosco, PVallaro, MFruttero, RScozzafava, ACarta, FSupuran, CT Novel small molecule protein arginine deiminase 4 (PAD4) inhibitors. Bioorg Med Chem Lett23:715-9 (2013) 
 
Carbonic anhydrase 9
Name:Carbonic anhydrase 9
Type:Enzyme
Mol. Mass.:49669.03
Organism:Homo sapiens (Human)
Description:Catalytic domain of human cloned isozyme was used in the assay
Residue:459
BDBM50014341
NameBDBM50014341
Synonyms:4-amino(immino)methylaminobenzoate
TypeSmall organic molecule
Emp. Form.C8H9N3O2
Mol. Mass.179.176
SMILESNC(=[NH2+])Nc1ccc(cc1)C([O-])=O